Reaction Details
TargetProstaglandin G/H synthase 1
LigandBDBM50172473
Substrate/Competitorn/a
Meas. Tech.ChEMBL_347804 (CHEMBL869505)
IC50 44000±n/a nM
Citation Stock, NMunoz, BWrigley, JDShearman, MSBeher, DPeachey, JWilliamson, TLBain, GChen, WJiang, XSt-Jacques, RPrasit, P The geminal dimethyl analogue of Flurbiprofen as a novel Abeta42 inhibitor and potential Alzheimer's disease modifying agent. Bioorg Med Chem Lett16:2219-23 (2006) 
 
Prostaglandin G/H synthase 1
Name:Prostaglandin G/H synthase 1
Type:Enzyme
Mol. Mass.:68692.62
Organism:Homo sapiens (Human)
Description:P23219
Residue:599
BDBM50172473
NameBDBM50172473
Synonyms:(-)-(2R)-2-(2-fluorobiphenyl-4-yl)propanoic acid (2R)-2-(2-fluorobiphenyl-4-yl)propanoic acid (R)-FLURBIPROFEN Flurizan | Tarenflurbil
TypeSmall organic molecule
Emp. Form.C15H13FO2
Mol. Mass.244.2609
SMILESC[C@@H](C(O)=O)c1ccc(c(F)c1)-c1ccccc1