Reaction Details
TargetFocal adhesion kinase 1
LigandBDBM50181997
Substrate/Competitorn/a
Meas. Tech.ChEMBL_347197 (CHEMBL865637)
IC50 7900±n/a nM
Citation Choi, HSWang, ZRichmond, WHe, XYang, KJiang, TSim, TKaranewsky, DGu, XJZhou, VLiu, YOhmori, OCaldwell, JGray, NHe, Y Design and synthesis of 7H-pyrrolo[2,3-d]pyrimidines as focal adhesion kinase inhibitors. Part 1. Bioorg Med Chem Lett16:2173-6 (2006) 
 
Focal adhesion kinase 1
Name:Focal adhesion kinase 1
Type:Tyrosine-protein kinase
Mol. Mass.:119233.17
Organism:Homo sapiens (Human)
Description:Q05397
Residue:1052
BDBM50181997
NameBDBM50181997
Synonyms:7-(pyridin-3-ylmethyl)-N-(3,4,5-trimethoxyphenyl)-7H-pyrrolo[2,3-d]pyrimidin-2-amine | CHEMBL426131
TypeSmall organic molecule
Emp. Form.C21H21N5O3
Mol. Mass.391.4231
SMILESCOc1cc(Nc2ncc3ccn(Cc4cccnc4)c3n2)cc(OC)c1OC