Reaction Details
TargetComplement C1s subcomponent
LigandBDBM50182168
Substrate/Competitorn/a
Meas. Tech.ChEBML_347235
Ki 400±n/a nM
Citation Subasinghe, NLTravins, JMAli, FHuang, HBallentine, SKMarugán, JJKhalil, EHufnagel, HRBone, RFDesJarlais, RLCrysler, CSNinan, NCummings, MDMolloy, CJTomczuk, BE A novel series of arylsulfonylthiophene-2-carboxamidine inhibitors of the complement component C1s. Bioorg Med Chem Lett16:2200-4 (2006) 
 
Complement C1s subcomponent
Name:Complement C1s subcomponent
Type:Protein
Mol. Mass.:76657.91
Organism:Homo sapiens (Human)
Description:P09871
Residue:688
BDBM50182168
NameBDBM50182168
Synonyms:4-(7-bromo-3H-benzo[d]imidazol-5-ylsulfonyl)-5-(methylthio)thiophene-2-carboxamidine | CHEMBL205698
TypeSmall organic molecule
Emp. Form.C13H11BrN4O2S3
Mol. Mass.431.351
SMILESCSc1sc(cc1S(=O)(=O)c1cc(Br)c2nc[nH]c2c1)C(N)=N