Reaction Details
TargetComplement C1s subcomponent
LigandBDBM50182173
Substrate/Competitorn/a
Meas. Tech.ChEBML_347235
Ki 100±n/a nM
Citation Subasinghe, NLTravins, JMAli, FHuang, HBallentine, SKMarugán, JJKhalil, EHufnagel, HRBone, RFDesJarlais, RLCrysler, CSNinan, NCummings, MDMolloy, CJTomczuk, BE A novel series of arylsulfonylthiophene-2-carboxamidine inhibitors of the complement component C1s. Bioorg Med Chem Lett16:2200-4 (2006) 
 
Complement C1s subcomponent
Name:Complement C1s subcomponent
Type:Protein
Mol. Mass.:76657.91
Organism:Homo sapiens (Human)
Description:P09871
Residue:688
BDBM50182173
NameBDBM50182173
Synonyms:4-[7-chloro-1-(2,6-difluoro-benzyl)-1H-benzoimidazole-5-sulfonyl]-5-methylsulfanyl-thiophene-2-carboxamidine | CHEMBL382443
TypeSmall organic molecule
Emp. Form.C20H15ClF2N4O2S3
Mol. Mass.513.004
SMILESCSc1sc(cc1S(=O)(=O)c1cc(Cl)c2n(Cc3c(F)cccc3F)cnc2c1)C(N)=N