Reaction Details
TargetComplement C1s subcomponent
LigandBDBM50182176
Substrate/Competitorn/a
Meas. Tech.ChEBML_347235
Ki 50±n/a nM
Citation Subasinghe, NLTravins, JMAli, FHuang, HBallentine, SKMarugán, JJKhalil, EHufnagel, HRBone, RFDesJarlais, RLCrysler, CSNinan, NCummings, MDMolloy, CJTomczuk, BE A novel series of arylsulfonylthiophene-2-carboxamidine inhibitors of the complement component C1s. Bioorg Med Chem Lett16:2200-4 (2006) 
 
Complement C1s subcomponent
Name:Complement C1s subcomponent
Type:Protein
Mol. Mass.:76657.91
Organism:Homo sapiens (Human)
Description:P09871
Residue:688
BDBM50182176
NameBDBM50182176
Synonyms:4-[7-bromo-1-(3-methyl-but-2-enyl)-1H-benzoimidazole-5-sulfonyl]-5-methylsulfanyl-thiophene-2-carboxamidine | CHEMBL206020
TypeSmall organic molecule
Emp. Form.C18H19BrN4O2S3
Mol. Mass.499.468
SMILES[#6]-[#16]-c1sc(cc1S(=O)(=O)c1cc(Br)c2n(-[#6]\[#6]=[#6](/[#6])-[#6])cnc2c1)-[#6](-[#7])=[#7]