Reaction Details
TargetComplement C1s subcomponent
LigandBDBM50182185
Substrate/Competitorn/a
Meas. Tech.ChEBML_347235
Ki 70±n/a nM
Citation Subasinghe, NLTravins, JMAli, FHuang, HBallentine, SKMarugán, JJKhalil, EHufnagel, HRBone, RFDesJarlais, RLCrysler, CSNinan, NCummings, MDMolloy, CJTomczuk, BE A novel series of arylsulfonylthiophene-2-carboxamidine inhibitors of the complement component C1s. Bioorg Med Chem Lett16:2200-4 (2006) 
 
Complement C1s subcomponent
Name:Complement C1s subcomponent
Type:Protein
Mol. Mass.:76657.91
Organism:Homo sapiens (Human)
Description:P09871
Residue:688
BDBM50182185
NameBDBM50182185
Synonyms:4-(1-allyl-7-bromo-1H-benzoimidazole-5-sulfonyl)-5-methylsulfanyl-thiophene-2-carboxamidine | CHEMBL381771
TypeSmall organic molecule
Emp. Form.C16H15BrN4O2S3
Mol. Mass.471.415
SMILESCSc1sc(cc1S(=O)(=O)c1cc(Br)c2n(CC=C)cnc2c1)C(N)=N