Reaction Details
TargetFocal adhesion kinase 1
LigandBDBM50184031
Substrate/Competitorn/a
Meas. Tech.ChEMBL_355040 (CHEMBL870124)
IC50 1330±n/a nM
Citation Choi, HSWang, ZRichmond, WHe, XYang, KJiang, TKaranewsky, DGu, XJZhou, VLiu, YChe, JLee, CCCaldwell, JKanazawa, TUmemura, IMatsuura, NOhmori, OHonda, TGray, NHe, Y Design and synthesis of 7H-pyrrolo[2,3-d]pyrimidines as focal adhesion kinase inhibitors. Part 2. Bioorg Med Chem Lett16:2689-92 (2006) 
 
Focal adhesion kinase 1
Name:Focal adhesion kinase 1
Type:Tyrosine-protein kinase
Mol. Mass.:119233.17
Organism:Homo sapiens (Human)
Description:Q05397
Residue:1052
BDBM50184031
NameBDBM50184031
Synonyms:CHEMBL379969 | N-(3-aminopropyl)-2-(3-(2-(3,4,5-trimethoxyphenylamino)-7H-pyrrolo[2,3-d]pyrimidin-7-yl)phenyl)acetamide
TypeSmall organic molecule
Emp. Form.C26H30N6O4
Mol. Mass.490.5542
SMILESCOc1cc(Nc2ncc3ccn(-c4cccc(CC(=O)NCCCN)c4)c3n2)cc(OC)c1OC