Reaction Details
TargetSphingosine 1-phosphate receptor 5
LigandBDBM50185524
Substrate/Competitorn/a
Meas. Tech.ChEMBL_374030 (CHEMBL864692)
IC50 11.0±n/a nM
Citation Yan, LBudhu, RHuo, PLynch, CLHale, JJMills, SGHajdu, RKeohane, CARosenbach, MJMilligan, JAShei, GJChrebet, GBergstrom, JCard, DMandala, SM 2-Aryl(pyrrolidin-4-yl)acetic acids are potent agonists of sphingosine-1-phosphate (S1P) receptors. Bioorg Med Chem Lett16:3564-8 (2006) 
 
Sphingosine 1-phosphate receptor 5
Name:Sphingosine 1-phosphate receptor 5
Type:G Protein-Coupled Receptor (GPCR)
Mol. Mass.:41796.42
Organism:Homo sapiens (Human)
Description:n/a
Residue:398
BDBM50185524
NameBDBM50185524
Synonyms:2-(trans-5-(4-(5-(4-((R)-3,3-difluorocyclopentyl)phenyl)-1,2,4-oxadiazol-3-yl)phenyl)pyrrolidin-3-yl)acetic acid | CHEMBL208838
TypeSmall organic molecule
Emp. Form.C25H25F2N3O3
Mol. Mass.453.4811
SMILESOC(=O)C[C@@H]1CN[C@H](C1)c1ccc(cc1)-c1noc(n1)-c1ccc(cc1)[C@@H]1CCC(F)(F)C1