Reaction Details
TargetSphingosine 1-phosphate receptor 1
LigandBDBM50158335
Substrate/Competitorn/a
Meas. Tech.ChEMBL_374026 (CHEMBL864688)
IC50 1.2±n/a nM
Citation Yan, LBudhu, RHuo, PLynch, CLHale, JJMills, SGHajdu, RKeohane, CARosenbach, MJMilligan, JAShei, GJChrebet, GBergstrom, JCard, DMandala, SM 2-Aryl(pyrrolidin-4-yl)acetic acids are potent agonists of sphingosine-1-phosphate (S1P) receptors. Bioorg Med Chem Lett16:3564-8 (2006) 
 
Sphingosine 1-phosphate receptor 1
Name:Sphingosine 1-phosphate receptor 1
Type:Enzyme
Mol. Mass.:42836.02
Organism:Homo sapiens (Human)
Description:P21453
Residue:382
BDBM50158335
NameBDBM50158335
Synonyms:1-(4-((4-phenyl-5-(trifluoromethyl)thiophen-2-yl)methoxy)benzyl)azetidine-3-carboxylic acid CHEMBL425563
TypeSmall organic molecule
Emp. Form.C23H20F3NO3S
Mol. Mass.447.47
SMILESOC(=O)C1CN(Cc2ccc(OCc3cc(c(s3)C(F)(F)F)-c3ccccc3)cc2)C1