Reaction Details
TargetSphingosine 1-phosphate receptor 1
LigandBDBM50185525
Substrate/Competitorn/a
Meas. Tech.ChEMBL_374026 (CHEMBL864688)
IC50 2±n/a nM
Citation Yan, LBudhu, RHuo, PLynch, CLHale, JJMills, SGHajdu, RKeohane, CARosenbach, MJMilligan, JAShei, GJChrebet, GBergstrom, JCard, DMandala, SM 2-Aryl(pyrrolidin-4-yl)acetic acids are potent agonists of sphingosine-1-phosphate (S1P) receptors. Bioorg Med Chem Lett16:3564-8 (2006) 
 
Sphingosine 1-phosphate receptor 1
Name:Sphingosine 1-phosphate receptor 1
Type:Enzyme
Mol. Mass.:42836.02
Organism:Homo sapiens (Human)
Description:P21453
Residue:382
BDBM50185525
NameBDBM50185525
Synonyms:2-(trans-5-(4-(5-(4-(4,4-difluorocyclohexyl)phenyl)-1,2,4-oxadiazol-3-yl)phenyl)pyrrolidin-3-yl)acetic acid | CHEMBL208648
TypeSmall organic molecule
Emp. Form.C26H27F2N3O3
Mol. Mass.467.5077
SMILESOC(=O)C[C@@H]1CN[C@H](C1)c1ccc(cc1)-c1noc(n1)-c1ccc(cc1)C1CCC(F)(F)CC1