Reaction Details
TargetSphingosine 1-phosphate receptor 5
LigandBDBM50186379
Substrate/Competitorn/a
Meas. Tech.ChEMBL_377653 (CHEMBL863682)
EC50>10000±n/a nM
Citation Vachal, PToth, LMHale, JJYan, LMills, SGChrebet, GLKoehane, CAHajdu, RMilligan, JARosenbach, MJMandala, S Highly selective and potent agonists of sphingosine-1-phosphate 1 (S1P1) receptor. Bioorg Med Chem Lett16:3684-7 (2006) 
 
Sphingosine 1-phosphate receptor 5
Name:Sphingosine 1-phosphate receptor 5
Type:G Protein-Coupled Receptor (GPCR)
Mol. Mass.:41796.42
Organism:Homo sapiens (Human)
Description:n/a
Residue:398
BDBM50186379
NameBDBM50186379
Synonyms:3-(4-(5-(3-cyano-4-isopropoxyphenyl)furan-2-yl)-3-methylphenyl)propanoic acid | CHEMBL210797
TypeSmall organic molecule
Emp. Form.C24H23NO4
Mol. Mass.389.4437
SMILESCC(C)Oc1ccc(cc1C#N)-c1ccc(o1)-c1ccc(CCC(O)=O)cc1C