Reaction Details
TargetSphingosine 1-phosphate receptor 3
LigandBDBM50186382
Substrate/Competitorn/a
Meas. Tech.ChEMBL_377652 (CHEMBL863681)
EC50>10000±n/a nM
Citation Vachal, PToth, LMHale, JJYan, LMills, SGChrebet, GLKoehane, CAHajdu, RMilligan, JARosenbach, MJMandala, S Highly selective and potent agonists of sphingosine-1-phosphate 1 (S1P1) receptor. Bioorg Med Chem Lett16:3684-7 (2006) 
 
Sphingosine 1-phosphate receptor 3
Name:Sphingosine 1-phosphate receptor 3
Type:G Protein-Coupled Receptor (GPCR)
Mol. Mass.:42278.13
Organism:Homo sapiens (Human)
Description:Q99500
Residue:378
BDBM50186382
NameBDBM50186382
Synonyms:3-(4-(2-(3-cyano-4-isopropoxyphenyl)thiazol-5-yl)-3-methylphenyl)propanoic acid | CHEMBL379612
TypeSmall organic molecule
Emp. Form.C23H22N2O3S
Mol. Mass.406.497
SMILESCC(C)Oc1ccc(cc1C#N)-c1ncc(s1)-c1ccc(CCC(O)=O)cc1C