Reaction Details
TargetSphingosine 1-phosphate receptor 1
LigandBDBM50186393
Substrate/Competitorn/a
Meas. Tech.ChEMBL_377651 (CHEMBL863677)
EC50 1.6±n/a nM
Citation Vachal, PToth, LMHale, JJYan, LMills, SGChrebet, GLKoehane, CAHajdu, RMilligan, JARosenbach, MJMandala, S Highly selective and potent agonists of sphingosine-1-phosphate 1 (S1P1) receptor. Bioorg Med Chem Lett16:3684-7 (2006) 
 
Sphingosine 1-phosphate receptor 1
Name:Sphingosine 1-phosphate receptor 1
Type:Enzyme
Mol. Mass.:42836.02
Organism:Homo sapiens (Human)
Description:P21453
Residue:382
BDBM50186393
NameBDBM50186393
Synonyms:3-(4-(2-(3-cyano-4-isopropoxyphenyl)-2H-tetrazol-5-yl)-3-methylphenyl)propanoic acid | CHEMBL210345
TypeSmall organic molecule
Emp. Form.C21H21N5O3
Mol. Mass.391.4231
SMILESCC(C)Oc1ccc(cc1C#N)-n1nnc(n1)-c1ccc(CCC(O)=O)cc1C