Reaction Details
TargetSphingosine 1-phosphate receptor 1
LigandBDBM50186399
Substrate/Competitorn/a
Meas. Tech.ChEMBL_377651 (CHEMBL863677)
EC50>1000±n/a nM
Citation Vachal, PToth, LMHale, JJYan, LMills, SGChrebet, GLKoehane, CAHajdu, RMilligan, JARosenbach, MJMandala, S Highly selective and potent agonists of sphingosine-1-phosphate 1 (S1P1) receptor. Bioorg Med Chem Lett16:3684-7 (2006) 
 
Sphingosine 1-phosphate receptor 1
Name:Sphingosine 1-phosphate receptor 1
Type:Enzyme
Mol. Mass.:42836.02
Organism:Homo sapiens (Human)
Description:P21453
Residue:382
BDBM50186399
NameBDBM50186399
Synonyms:3-(4-(5-(3-cyanophenyl)-1,3,4-thiadiazol-2-yl)-3-methylphenyl)propanoic acid | CHEMBL207716
TypeSmall organic molecule
Emp. Form.C19H15N3O2S
Mol. Mass.349.406
SMILESCc1cc(CCC(O)=O)ccc1-c1nnc(s1)-c1cccc(c1)C#N