Reaction Details
TargetSphingosine 1-phosphate receptor 5
LigandBDBM50186393
Substrate/Competitorn/a
Meas. Tech.ChEMBL_377653 (CHEMBL863682)
EC50 43±n/a nM
Citation Vachal, PToth, LMHale, JJYan, LMills, SGChrebet, GLKoehane, CAHajdu, RMilligan, JARosenbach, MJMandala, S Highly selective and potent agonists of sphingosine-1-phosphate 1 (S1P1) receptor. Bioorg Med Chem Lett16:3684-7 (2006) 
 
Sphingosine 1-phosphate receptor 5
Name:Sphingosine 1-phosphate receptor 5
Type:G Protein-Coupled Receptor (GPCR)
Mol. Mass.:41796.42
Organism:Homo sapiens (Human)
Description:n/a
Residue:398
BDBM50186393
NameBDBM50186393
Synonyms:3-(4-(2-(3-cyano-4-isopropoxyphenyl)-2H-tetrazol-5-yl)-3-methylphenyl)propanoic acid | CHEMBL210345
TypeSmall organic molecule
Emp. Form.C21H21N5O3
Mol. Mass.391.4231
SMILESCC(C)Oc1ccc(cc1C#N)-n1nnc(n1)-c1ccc(CCC(O)=O)cc1C