Reaction Details
TargetSphingosine 1-phosphate receptor 3
LigandBDBM50186397
Substrate/Competitorn/a
Meas. Tech.ChEMBL_377652 (CHEMBL863681)
EC50>10000±n/a nM
Citation Vachal, PToth, LMHale, JJYan, LMills, SGChrebet, GLKoehane, CAHajdu, RMilligan, JARosenbach, MJMandala, S Highly selective and potent agonists of sphingosine-1-phosphate 1 (S1P1) receptor. Bioorg Med Chem Lett16:3684-7 (2006) 
 
Sphingosine 1-phosphate receptor 3
Name:Sphingosine 1-phosphate receptor 3
Type:G Protein-Coupled Receptor (GPCR)
Mol. Mass.:42278.13
Organism:Homo sapiens (Human)
Description:Q99500
Residue:378
BDBM50186397
NameBDBM50186397
Synonyms:3-(4-(5-(3-cyano-4-isopropoxyphenyl)thiophen-2-yl)-3-methylphenyl)propanoic acid | CHEMBL377181
TypeSmall organic molecule
Emp. Form.C24H23NO3S
Mol. Mass.405.509
SMILESCC(C)Oc1ccc(cc1C#N)-c1ccc(s1)-c1ccc(CCC(O)=O)cc1C