Reaction Details
TargetSphingosine 1-phosphate receptor 1
LigandBDBM50186414
Substrate/Competitorn/a
Meas. Tech.ChEMBL_377651 (CHEMBL863677)
EC50 94±n/a nM
Citation Vachal, PToth, LMHale, JJYan, LMills, SGChrebet, GLKoehane, CAHajdu, RMilligan, JARosenbach, MJMandala, S Highly selective and potent agonists of sphingosine-1-phosphate 1 (S1P1) receptor. Bioorg Med Chem Lett16:3684-7 (2006) 
 
Sphingosine 1-phosphate receptor 1
Name:Sphingosine 1-phosphate receptor 1
Type:Enzyme
Mol. Mass.:42836.02
Organism:Homo sapiens (Human)
Description:P21453
Residue:382
BDBM50186414
NameBDBM50186414
Synonyms:3-(4-(5-(4-acetoxy-3-cyanophenyl)-1,3,4-thiadiazol-2-yl)-3-methylphenyl)propanoic acid | CHEMBL209988
TypeSmall organic molecule
Emp. Form.C21H17N3O4S
Mol. Mass.407.442
SMILESCC(=O)Oc1ccc(cc1C#N)-c1nnc(s1)-c1ccc(CCC(O)=O)cc1C