Reaction Details
TargetSphingosine 1-phosphate receptor 1
LigandBDBM50186416
Substrate/Competitorn/a
Meas. Tech.ChEMBL_377651 (CHEMBL863677)
EC50 19±n/a nM
Citation Vachal, PToth, LMHale, JJYan, LMills, SGChrebet, GLKoehane, CAHajdu, RMilligan, JARosenbach, MJMandala, S Highly selective and potent agonists of sphingosine-1-phosphate 1 (S1P1) receptor. Bioorg Med Chem Lett16:3684-7 (2006) 
 
Sphingosine 1-phosphate receptor 1
Name:Sphingosine 1-phosphate receptor 1
Type:Enzyme
Mol. Mass.:42836.02
Organism:Homo sapiens (Human)
Description:P21453
Residue:382
BDBM50186416
NameBDBM50186416
Synonyms:3-(4-(5-(5-chloro-6-isopropoxypyridin-3-yl)-1,3,4-oxadiazol-2-yl)-3-methylphenyl)propanoic acid | CHEMBL378562
TypeSmall organic molecule
Emp. Form.C20H20ClN3O4
Mol. Mass.401.843
SMILESCC(C)Oc1ncc(cc1Cl)-c1nnc(o1)-c1ccc(CCC(O)=O)cc1C