Reaction Details
TargetCyclin-dependent kinase 1
LigandBDBM50186419
Substrate/Competitorn/a
Meas. Tech.ChEMBL_377580 (CHEMBL869289)
IC50 1410±n/a nM
Citation Huang, SConnolly, PJLin, REmanuel, SMiddleton, SA Synthesis and evaluation of N-acyl sulfonamides as potential prodrugs of cyclin-dependent kinase inhibitor JNJ-7706621. Bioorg Med Chem Lett16:3639-41 (2006) 
 
Cyclin-dependent kinase 1
Name:Cyclin-dependent kinase 1
Type:Enzyme Subunit
Mol. Mass.:34101.08
Organism:Homo sapiens (Human)
Description:P06493
Residue:297
BDBM50186419
NameBDBM50186419
Synonyms:(R)-2-amino-N-(4-(5-amino-1-(2,6-difluorobenzoyl)-1H-1,2,4-triazol-3-ylamino)phenylsulfonyl)-3-hydroxypropanamide | CHEMBL212264
TypeSmall organic molecule
Emp. Form.C18H17F2N7O5S
Mol. Mass.481.433
SMILESN[C@H](CO)C(=O)NS(=O)(=O)c1ccc(Nc2nc(N)n(n2)C(=O)c2c(F)cccc2F)cc1