Reaction Details
TargetS-ribosylhomocysteine lyase
LigandBDBM50186748
Substrate/Competitorn/a
Meas. Tech.ChEMBL_353578 (CHEMBL861693)
Ki 132000±n/a nM
Citation Shen, GRajan, RZhu, JBell, CEPei, D Design and synthesis of substrate and intermediate analogue inhibitors of S-ribosylhomocysteinase. J Med Chem49:3003-11 (2006) 
 
S-ribosylhomocysteine lyase
Name:S-ribosylhomocysteine lyase
Type:PROTEIN
Mol. Mass.:17709.00
Organism:Bacillus subtilis
Description:ChEMBL_764478
Residue:157
BDBM50186748
NameBDBM50186748
Synonyms:(S)-2-amino-6-(2-mercaptoacetamido)hexanoic acid | CHEMBL206556
TypeSmall organic molecule
Emp. Form.C8H16N2O3S
Mol. Mass.220.289
SMILESN[C@@H](CCCCNC(=O)CS)C(O)=O