Reaction Details
TargetDelta-type opioid receptor
LigandBDBM50188155
Substrate/Competitorn/a
Meas. Tech.ChEMBL_379861 (CHEMBL864849)
IC50 48207±n/a nM
Citation Nefzi, AOstresh, JMAppel, JRBidlack, JDooley, CTHoughten, RA Identification of potent and highly selective chiral tri-amine and tetra-amine mu opioid receptors ligands: an example of lead optimization using mixture-based libraries. Bioorg Med Chem Lett16:4331-8 (2006) 
 
Delta-type opioid receptor
Name:Delta-type opioid receptor
Type:G Protein-Coupled Receptor (GPCR)
Mol. Mass.:40382.98
Organism:Homo sapiens (Human)
Description:Competition binding assays were carried out using membrane preparations from transfected HN9.10 cells that constitutively expressed the delta opioid receptor.
Residue:372
BDBM50188155
NameBDBM50188155
Synonyms:4-[(2S)-2-amino-3-{[(2R)-1-(4-hydroxyphenyl)-3-{methyl[(2S)-1-(methylamino)-3-phenylpropan-2-yl]amino}propan-2-yl](methyl)amino}propyl]phenol | CHEMBL211696
TypeSmall organic molecule
Emp. Form.C30H42N4O2
Mol. Mass.490.6801
SMILESCNC[C@H](Cc1ccccc1)N(C)C[C@@H](Cc1ccc(O)cc1)N(C)C[C@@H](N)Cc1ccc(O)cc1