Reaction Details
TargetMu-type opioid receptor
LigandBDBM50188165
Substrate/Competitorn/a
Meas. Tech.ChEMBL_379860 (CHEMBL864843)
IC50 181±n/a nM
Citation Nefzi, AOstresh, JMAppel, JRBidlack, JDooley, CTHoughten, RA Identification of potent and highly selective chiral tri-amine and tetra-amine mu opioid receptors ligands: an example of lead optimization using mixture-based libraries. Bioorg Med Chem Lett16:4331-8 (2006) 
 
Mu-type opioid receptor
Name:Mu-type opioid receptor
Type:G Protein-Coupled Receptor (GPCR)
Mol. Mass.:44503.11
Organism:Rattus norvegicus (rat)
Description:Competition binding assays were carried out using membrane preparations from transfected HN9.10 cells that constitutively expressed the mu opioid receptor.
Residue:398
BDBM50188165
NameBDBM50188165
Synonyms:(4S,7S,10S,13S,16S,17R)-16-({[(2S)-1-amino-4-(methylsulfanyl)butan-2-yl]amino}methyl)-13-benzyl-4,7,10-tris[(4-hydroxyphenyl)methyl]-3,6,9,12,15-pentaazaoctadecan-17-ol | CHEMBL212353
TypeSmall organic molecule
Emp. Form.C47H71N7O4S
Mol. Mass.830.176
SMILESCCN[C@H](CN[C@H](CN[C@H](CN[C@H](CN[C@@H](CN[C@H](CN)CCSC)[C@@H](C)O)Cc1ccccc1)Cc1ccc(O)cc1)Cc1ccc(O)cc1)Cc1ccc(O)cc1