Reaction Details
TargetMu-type opioid receptor
LigandBDBM50188151
Substrate/Competitorn/a
Meas. Tech.ChEMBL_379860 (CHEMBL864843)
IC50 958±n/a nM
Citation Nefzi, AOstresh, JMAppel, JRBidlack, JDooley, CTHoughten, RA Identification of potent and highly selective chiral tri-amine and tetra-amine mu opioid receptors ligands: an example of lead optimization using mixture-based libraries. Bioorg Med Chem Lett16:4331-8 (2006) 
 
Mu-type opioid receptor
Name:Mu-type opioid receptor
Type:G Protein-Coupled Receptor (GPCR)
Mol. Mass.:44503.11
Organism:Rattus norvegicus (rat)
Description:Competition binding assays were carried out using membrane preparations from transfected HN9.10 cells that constitutively expressed the mu opioid receptor.
Residue:398
BDBM50188151
NameBDBM50188151
Synonyms:4-[(2R)-2-(dimethylamino)-3-{[(2S)-1-(4-hydroxyphenyl)-3-{methyl[(2R)-1-(methylamino)-3-phenylpropan-2-yl]amino}propan-2-yl](methyl)amino}propyl]phenol | CHEMBL387368
TypeSmall organic molecule
Emp. Form.C32H46N4O2
Mol. Mass.518.7332
SMILESCNC[C@@H](Cc1ccccc1)N(C)C[C@H](Cc1ccc(O)cc1)N(C)C[C@@H](Cc1ccc(O)cc1)N(C)C