Reaction Details
TargetMu-type opioid receptor
LigandBDBM50188200
Substrate/Competitorn/a
Meas. Tech.ChEMBL_379860 (CHEMBL864843)
IC50 27±n/a nM
Citation Nefzi, AOstresh, JMAppel, JRBidlack, JDooley, CTHoughten, RA Identification of potent and highly selective chiral tri-amine and tetra-amine mu opioid receptors ligands: an example of lead optimization using mixture-based libraries. Bioorg Med Chem Lett16:4331-8 (2006) 
 
Mu-type opioid receptor
Name:Mu-type opioid receptor
Type:G Protein-Coupled Receptor (GPCR)
Mol. Mass.:44503.11
Organism:Rattus norvegicus (rat)
Description:Competition binding assays were carried out using membrane preparations from transfected HN9.10 cells that constitutively expressed the mu opioid receptor.
Residue:398
BDBM50188200
NameBDBM50188200
Synonyms:4-[(2S)-3-{[(2S)-1-{[(2S)-1-[(2S)-2-({[(2S)-1-{[(2S)-1-amino-3-phenylpropan-2-yl]amino}-3-(4-hydroxyphenyl)propan-2-yl]amino}methyl)pyrrolidin-1-yl]-3-phenylpropan-2-yl]amino}-3-(4-hydroxyphenyl)propan-2-yl]amino}-2-(ethylamino)propyl]phenol | CHEMBL219414
TypeSmall organic molecule
Emp. Form.C52H71N7O3
Mol. Mass.842.1652
SMILESCCN[C@H](CN[C@H](CN[C@H](CN1CCC[C@H]1CN[C@H](CN[C@H](CN)Cc1ccccc1)Cc1ccc(O)cc1)Cc1ccccc1)Cc1ccc(O)cc1)Cc1ccc(O)cc1