Reaction Details
TargetMu-type opioid receptor
LigandBDBM50188205
Substrate/Competitorn/a
Meas. Tech.ChEMBL_379863 (CHEMBL864851)
IC50 4464±n/a nM
Citation Nefzi, AOstresh, JMAppel, JRBidlack, JDooley, CTHoughten, RA Identification of potent and highly selective chiral tri-amine and tetra-amine mu opioid receptors ligands: an example of lead optimization using mixture-based libraries. Bioorg Med Chem Lett16:4331-8 (2006) 
 
Mu-type opioid receptor
Name:Mu-type opioid receptor
Type:Enzyme Catalytic Domain
Mol. Mass.:11165.58
Organism:GUINEA PIG
Description:P97266
Residue:98
BDBM50188205
NameBDBM50188205
Synonyms:4-[(2S)-2-amino-3-{benzyl[(2S)-1-{benzyl[(2S)-1-[(2S)-2-[(benzylamino)methyl]pyrrolidin-1-yl]-3-phenylpropan-2-yl]amino}-3-(4-hydroxyphenyl)propan-2-yl]amino}propyl]phenol | CHEMBL377733
TypeSmall organic molecule
Emp. Form.C53H63N5O2
Mol. Mass.802.0996
SMILESN[C@H](CN(Cc1ccccc1)[C@H](CN(Cc1ccccc1)[C@H](CN1CCC[C@H]1CNCc1ccccc1)Cc1ccccc1)Cc1ccc(O)cc1)Cc1ccc(O)cc1