Reaction Details
TargetKappa-type opioid receptor
LigandBDBM50188197
Substrate/Competitorn/a
Meas. Tech.ChEMBL_379862 (CHEMBL864850)
IC50 6059±n/a nM
Citation Nefzi, AOstresh, JMAppel, JRBidlack, JDooley, CTHoughten, RA Identification of potent and highly selective chiral tri-amine and tetra-amine mu opioid receptors ligands: an example of lead optimization using mixture-based libraries. Bioorg Med Chem Lett16:4331-8 (2006) 
 
Kappa-type opioid receptor
Name:Kappa-type opioid receptor
Type:G Protein-Coupled Receptor (GPCR)
Mol. Mass.:42648.76
Organism:Homo sapiens (Human)
Description:P41145
Residue:380
BDBM50188197
NameBDBM50188197
Synonyms:4-[(2R)-2-(dimethylamino)-3-{[(2R)-1-(4-hydroxyphenyl)-3-{methyl[(2S)-1-(methylamino)-3-phenylpropan-2-yl]amino}propan-2-yl](methyl)amino}propyl]phenol | CHEMBL213416
TypeSmall organic molecule
Emp. Form.C32H46N4O2
Mol. Mass.518.7332
SMILESCNC[C@H](Cc1ccccc1)N(C)C[C@@H](Cc1ccc(O)cc1)N(C)C[C@@H](Cc1ccc(O)cc1)N(C)C