Reaction Details
TargetBeta-secretase 1
LigandBDBM50188338
Substrate/Competitorn/a
Meas. Tech.ChEMBL_379150 (CHEMBL863610)
IC50 3.3±n/a nM
Citation Hamada, YIgawa, NIkari, HZiora, ZNguyen, JTYamani, AHidaka, KKimura, TSaito, KHayashi, YEbina, MIshiura, SKiso, Y beta-Secretase inhibitors: modification at the P4 position and improvement of inhibitory activity in cultured cells. Bioorg Med Chem Lett16:4354-9 (2006) 
 
Beta-secretase 1
Name:Beta-secretase 1
Type:Protein
Mol. Mass.:55755.10
Organism:Homo sapiens (Human)
Description:P56817
Residue:501
BDBM50188338
NameBDBM50188338
Synonyms:CHEMBL411711 N-((S)-3-((S)-1-((S)-1-((2S,3R)-4-(3-(2H-tetrazol-5-yl)phenylamino)-3-hydroxy-4-oxo-1-phenylbutan-2-ylamino)-3-cyclohexyl-1-oxopropan-2-ylamino)-3-methyl-1-oxobutan-2-ylamino)-2-amino-3-oxopropyl)-2H-tetrazole-5-carboxamide
TypeSmall organic molecule
Emp. Form.C36H48N14O6
Mol. Mass.772.8565
SMILESCC(C)[C@H](NC(=O)[C@@H](N)CNC(=O)c1nnn[nH]1)C(=O)N[C@@H](CC1CCCCC1)C(=O)N[C@@H](Cc1ccccc1)[C@@H](O)C(=O)Nc1cccc(c1)-c1nnn[nH]1