Reaction Details
TargetReceptor-type tyrosine-protein phosphatase epsilon
LigandBDBM50188779
Substrate/Competitorn/a
Meas. Tech.ChEMBL_389281 (CHEMBL868037)
IC50>500000±n/a nM
Citation Amarasinghe, KKEvdokimov, AGEvidokimov, AGXu, KClark, CMMaier, MBSrivastava, AColson, AOGerwe, GSStake, GEHoward, BWPokross, MEGray, JLPeters, KG Design and synthesis of potent, non-peptidic inhibitors of HPTPbeta. Bioorg Med Chem Lett16:4252-6 (2006) 
 
Receptor-type tyrosine-protein phosphatase epsilon
Name:Receptor-type tyrosine-protein phosphatase epsilon
Type:Protein
Mol. Mass.:80646.31
Organism:Homo sapiens (Human)
Description:P23469
Residue:700
BDBM50188779
NameBDBM50188779
Synonyms:CHEMBL378423 | ammonium N-{4-[4-ethoxy-2,2-bis(methoxycarbonyl)-4-oxobutyl]phenyl}sulfamate
TypeSmall organic molecule
Emp. Form.C16H20NO9S
Mol. Mass.402.397
SMILESCCOC(=O)CC(Cc1ccc(NS([O-])(=O)=O)cc1)(C(=O)OC)C(=O)OC