Reaction Details
TargetGalanin receptor type 3
LigandBDBM50187923
Substrate/Competitorn/a
Meas. Tech.ChEMBL_368823 (CHEMBL864918)
Ki 17±n/a nM
Citation Konkel, MJLagu, BBoteju, LWJimenez, HNoble, SWalker, MWChandrasena, GBlackburn, TPNikam, SSWright, JLKornberg, BEGregory, TPugsley, TAAkunne, HZoski, KWise, LD 3-arylimino-2-indolones are potent and selective galanin GAL3 receptor antagonists. J Med Chem49:3757-8 (2006) 
 
Galanin receptor type 3
Name:Galanin receptor type 3
Type:Enzyme Catalytic Domain
Mol. Mass.:39599.97
Organism:Homo sapiens (Human)
Description:Galanin R3 GALR3 HUMAN::O60755
Residue:368
BDBM50187923
NameBDBM50187923
Synonyms:1,3-dihydro-1-phenyl-3-[[3-(trilfluoromethyl)phenyl]imino]-2H-indol-2-one CHEMBL210288
TypeSmall organic molecule
Emp. Form.C21H13F3N2O
Mol. Mass.366.3359
SMILESFC(F)(F)c1cccc(c1)\N=C1\C(=O)N(c2ccccc12)c1ccccc1