Reaction Details
TargetVascular endothelial growth factor receptor 2
LigandBDBM50189603
Substrate/Competitorn/a
Meas. Tech.ChEMBL_368576 (CHEMBL866820)
IC50 40.0±n/a nM
Citation Borzilleri, RMBhide, RSBarrish, JCD'Arienzo, CJDerbin, GMFargnoli, JHunt, JTJeyaseelan, RKamath, AKukral, DWMarathe, PMortillo, SQian, LTokarski, JSWautlet, BSZheng, XLombardo, LJ Discovery and evaluation of N-cyclopropyl- 2,4-difluoro-5-((2-(pyridin-2-ylamino)thiazol-5- ylmethyl)amino)benzamide (BMS-605541), a selective and orally efficacious inhibitor of vascular endothelial growth factor receptor-2. J Med Chem49:3766-9 (2006) 
 
Vascular endothelial growth factor receptor 2
Name:Vascular endothelial growth factor receptor 2
Type:Receptor Tyrosine Kinase
Mol. Mass.:151510.97
Organism:Homo sapiens (Human)
Description:P35968
Residue:1356
BDBM50189603
NameBDBM50189603
Synonyms:CHEMBL377734 | N-cyclopropyl-2,4-difluoro-5-((2-(pyridin-2-ylamino)thiazol-5-yl)methylamino)benzamide
TypeSmall organic molecule
Emp. Form.C19H17F2N5OS
Mol. Mass.401.433
SMILESFc1cc(F)c(cc1NCc1cnc(Nc2ccccn2)s1)C(=O)NC1CC1