Reaction Details
TargetMelanin-concentrating hormone receptor 1
LigandBDBM50190268
Substrate/Competitorn/a
Meas. Tech.ChEMBL_405654 (CHEMBL869867)
Ki 4±n/a nM
Citation Rowbottom, MWVickers, TDDyck, BGrey, JTamiya, JZhang, MKiankarimi, MWu, DDwight, WWade, WSSchwarz, DHeise, CEMadan, AFisher, APetroski, RGoodfellow, VS Synthesis and structure-activity relationships of retro bis-aminopyrrolidine urea (rAPU) derived small-molecule antagonists of the melanin-concentrating hormone receptor-1 (MCH-R1). Part 1. Bioorg Med Chem Lett16:4450-7 (2006) 
 
Melanin-concentrating hormone receptor 1
Name:Melanin-concentrating hormone receptor 1
Type:G Protein-Coupled Receptor (GPCR)
Mol. Mass.:45976.27
Organism:Homo sapiens (Human)
Description:Membranes from CHO-K1 cells stably expressing human MCH1R were used in assays.
Residue:422
BDBM50190268
NameBDBM50190268
Synonyms:4'-methylsulfanyl-biphenyl-4-carboxylic acid methyl-{(S)-1-[(S)-3-(3-phenyl-propylamino)-pyrrolidine-1-carbonyl]-pyrrolidin-3-yl}-amide | CHEMBL213052
TypeSmall organic molecule
Emp. Form.C33H40N4O2S
Mol. Mass.556.761
SMILESCSc1ccc(cc1)-c1ccc(cc1)C(=O)N(C)[C@H]1CCN(C1)C(=O)N1CC[C@@H](C1)NCCCc1ccccc1