Reaction Details
TargetAdenylate cyclase type 10
LigandBDBM50607660
Substrate/Competitorn/a
Meas. Tech.ChEMBL_2263077 (CHEMBL5218088)
IC50 64±n/a nM
Citation Miller, MRossetti, TFerreira, JGhanem, LBalbach, MKaur, NLevin, LRBuck, JKehr, MCoquille, Svan den Heuvel, JSteegborn, CFushimi, MFinkin-Groner, EMyers, RWKargman, SLiverton, NJHuggins, DJMeinke, PT Design, Synthesis, and Pharmacological Evaluation of Second-Generation Soluble Adenylyl Cyclase (sAC, ADCY10) Inhibitors with Slow Dissociation Rates. J Med Chem65:15208-15226 (2022) 
 
Adenylate cyclase type 10
Name:Adenylate cyclase type 10
Type:PROTEIN
Mol. Mass.:187169.28
Organism:Homo sapiens (Human)
Description:ChEMBL_514281
Residue:1610
BDBM50607660
NameBDBM50607660
Synonyms:CHEMBL5221008
TypeSmall organic molecule
Emp. Form.C15H13Cl2N5
Mol. Mass.334.203
SMILESCn1cc(Cc2ccccc2Cl)c(n1)-c1cc(Cl)nc(N)n1