Reaction Details
TargetAdenylate cyclase type 10
LigandBDBM50607683
Substrate/Competitorn/a
Meas. Tech.ChEMBL_2263077 (CHEMBL5218088)
IC50 3.3±n/a nM
Citation Miller, MRossetti, TFerreira, JGhanem, LBalbach, MKaur, NLevin, LRBuck, JKehr, MCoquille, Svan den Heuvel, JSteegborn, CFushimi, MFinkin-Groner, EMyers, RWKargman, SLiverton, NJHuggins, DJMeinke, PT Design, Synthesis, and Pharmacological Evaluation of Second-Generation Soluble Adenylyl Cyclase (sAC, ADCY10) Inhibitors with Slow Dissociation Rates. J Med Chem65:15208-15226 (2022) 
 
Adenylate cyclase type 10
Name:Adenylate cyclase type 10
Type:PROTEIN
Mol. Mass.:187169.28
Organism:Homo sapiens (Human)
Description:ChEMBL_514281
Residue:1610
BDBM50607683
NameBDBM50607683
Synonyms:CHEMBL5219579
TypeSmall organic molecule
Emp. Form.C22H25ClF2N6O3
Mol. Mass.494.922
SMILESNc1nc(Cl)cc(n1)-c1nn(cc1Cc1ccccc1OCCN1CCO[C@@H](CO)C1)C(F)F