Reaction Details
TargetD(4) dopamine receptor
LigandBDBM50193296
Substrate/Competitorn/a
Meas. Tech.ChEMBL_382039 (CHEMBL863651)
Ki 6.4±n/a nM
Citation Kolasa, TMatulenko, MAHakeem, AAPatel, MVMortell, KBhatia, PHenry, RNakane, MHsieh, GCTerranova, MAUchic, MEMiller, LNChang, RDonnelly-Roberts, DLNamovic, MTHollingsworth, PRMartino, BEl Kouhen, OMarsh, KCWetter, JMMoreland, RBBrioni, JDStewart, AO 1-aryl-3-(4-pyridine-2-ylpiperazin-1-yl)propan-1-one oximes as potent dopamine D4 receptor agonists for the treatment of erectile dysfunction. J Med Chem49:5093-109 (2006) 
 
D(4) dopamine receptor
Name:D(4) dopamine receptor
Type:Enzyme
Mol. Mass.:48373.19
Organism:Homo sapiens (Human)
Description:P21917
Residue:419
BDBM50193296
NameBDBM50193296
Synonyms:(Z)-1-(3-fluorophenyl)-3-(4-pyridin-2-ylpiperazin-1-yl)propan-1-one O-methyloxime | CHEMBL213164
TypeSmall organic molecule
Emp. Form.C19H23FN4O
Mol. Mass.342.4105
SMILESCO\N=C(\CCN1CCN(CC1)c1ccccn1)c1cccc(F)c1