Reaction Details
TargetD(4) dopamine receptor
LigandBDBM50193361
Substrate/Competitorn/a
Meas. Tech.ChEMBL_382039 (CHEMBL863651)
Ki 11.6±n/a nM
Citation Kolasa, TMatulenko, MAHakeem, AAPatel, MVMortell, KBhatia, PHenry, RNakane, MHsieh, GCTerranova, MAUchic, MEMiller, LNChang, RDonnelly-Roberts, DLNamovic, MTHollingsworth, PRMartino, BEl Kouhen, OMarsh, KCWetter, JMMoreland, RBBrioni, JDStewart, AO 1-aryl-3-(4-pyridine-2-ylpiperazin-1-yl)propan-1-one oximes as potent dopamine D4 receptor agonists for the treatment of erectile dysfunction. J Med Chem49:5093-109 (2006) 
 
D(4) dopamine receptor
Name:D(4) dopamine receptor
Type:Enzyme
Mol. Mass.:48373.19
Organism:Homo sapiens (Human)
Description:P21917
Residue:419
BDBM50193361
NameBDBM50193361
Synonyms:(Z)-1-(4-chloro-3-methylphenyl)-3-(4-pyridin-2-ylpiperazin-1-yl)propan-1-one O-methyloxime | CHEMBL215450
TypeSmall organic molecule
Emp. Form.C20H25ClN4O
Mol. Mass.372.892
SMILESCO\N=C(\CCN1CCN(CC1)c1ccccn1)c1ccc(Cl)c(C)c1