Reaction Details
TargetDual specificity mitogen-activated protein kinase kinase 1
LigandBDBM50187841
Substrate/Competitorn/a
Meas. Tech.ChEMBL_420098 (CHEMBL873740)
EC50 1480±n/a nM
Citation El Abdellaoui, HVaraprasad, CVBarawkar, DChakravarty, SMaderna, ATam, RChen, HAllan, MWu, JZAppleby, TYan, SZhang, WLang, SYao, NHamatake, RHong, Z Identification of isothiazole-4-carboxamidines derivatives as a novel class of allosteric MEK1 inhibitors. Bioorg Med Chem Lett16:5561-6 (2006) 
 
Dual specificity mitogen-activated protein kinase kinase 1
Name:Dual specificity mitogen-activated protein kinase kinase 1
Type:Other Protein Type
Mol. Mass.:43439.03
Organism:Homo sapiens (Human)
Description:Full-length human MEK-1 was generated by PCR and purified as a fusion protein from Escherichia coli lysates.
Residue:393
BDBM50187841
NameBDBM50187841
Synonyms:3-hydroxy-5-(4-iodo-2-methylphenylamino)-N-isopropylisothiazole-4-carboxamidine CHEMBL211359
TypeSmall organic molecule
Emp. Form.C14H17IN4OS
Mol. Mass.416.28
SMILESCC(C)NC(=N)c1c(Nc2ccc(I)cc2C)s[nH]c1=O