Reaction Details
TargetDual specificity mitogen-activated protein kinase kinase 1
LigandBDBM50194028
Substrate/Competitorn/a
Meas. Tech.ChEMBL_420098 (CHEMBL873740)
EC50 47±n/a nM
Citation El Abdellaoui, HVaraprasad, CVBarawkar, DChakravarty, SMaderna, ATam, RChen, HAllan, MWu, JZAppleby, TYan, SZhang, WLang, SYao, NHamatake, RHong, Z Identification of isothiazole-4-carboxamidines derivatives as a novel class of allosteric MEK1 inhibitors. Bioorg Med Chem Lett16:5561-6 (2006) 
 
Dual specificity mitogen-activated protein kinase kinase 1
Name:Dual specificity mitogen-activated protein kinase kinase 1
Type:Other Protein Type
Mol. Mass.:43439.03
Organism:Homo sapiens (Human)
Description:Full-length human MEK-1 was generated by PCR and purified as a fusion protein from Escherichia coli lysates.
Residue:393
BDBM50194028
NameBDBM50194028
Synonyms:5-4-2,5-dichlorophenoxy)phenylamino)-3-hydroxy-N-2-hydroxyethyl)isothiazole-4-carboximidamide | CHEMBL216833
TypeSmall organic molecule
Emp. Form.C18H16Cl2N4O3S
Mol. Mass.439.316
SMILESNC(=NCCO)c1c(Nc2ccc(Oc3cc(Cl)ccc3Cl)cc2)s[nH]c1=O