Reaction Details
TargetTyrosine-protein kinase receptor UFO
LigandBDBM50196392
Substrate/Competitorn/a
Meas. Tech.ChEMBL_420105 (CHEMBL873747)
IC50 389±n/a nM
Citation El Abdellaoui, HVaraprasad, CVBarawkar, DChakravarty, SMaderna, ATam, RChen, HAllan, MWu, JZAppleby, TYan, SZhang, WLang, SYao, NHamatake, RHong, Z Identification of isothiazole-4-carboxamidines derivatives as a novel class of allosteric MEK1 inhibitors. Bioorg Med Chem Lett16:5561-6 (2006) 
 
Tyrosine-protein kinase receptor UFO
Name:Tyrosine-protein kinase receptor UFO
Type:Enzyme
Mol. Mass.:98316.97
Organism:Homo sapiens (Human)
Description:P30530
Residue:894
BDBM50196392
NameBDBM50196392
Synonyms:3-hydroxy-N-(2-hydroxy-1-methyl-ethyl)-5-(4-phenylamino-phenylamino)-isothiazole-4-carboxamidine CHEMBL253116
TypeSmall organic molecule
Emp. Form.C19H21N5O2S
Mol. Mass.383.467
SMILESCC(CO)N=C(N)c1c(Nc2ccc(Nc3ccccc3)cc2)s[nH]c1=O