Reaction Details
TargetDual specificity mitogen-activated protein kinase kinase 1
LigandBDBM50194066
Substrate/Competitorn/a
Meas. Tech.ChEMBL_420097 (CHEMBL873739)
IC50 298±n/a nM
Citation El Abdellaoui, HVaraprasad, CVBarawkar, DChakravarty, SMaderna, ATam, RChen, HAllan, MWu, JZAppleby, TYan, SZhang, WLang, SYao, NHamatake, RHong, Z Identification of isothiazole-4-carboxamidines derivatives as a novel class of allosteric MEK1 inhibitors. Bioorg Med Chem Lett16:5561-6 (2006) 
 
Dual specificity mitogen-activated protein kinase kinase 1
Name:Dual specificity mitogen-activated protein kinase kinase 1
Type:Other Protein Type
Mol. Mass.:43439.03
Organism:Homo sapiens (Human)
Description:Full-length human MEK-1 was generated by PCR and purified as a fusion protein from Escherichia coli lysates.
Residue:393
BDBM50194066
NameBDBM50194066
Synonyms:5-4-2,5-dichlorophenoxy)phenylamino)-3-hydroxy-N-3-4-methylpiperazin-1-yl)propyl)isothiazole-4-carboximidamide | CHEMBL386457
TypeSmall organic molecule
Emp. Form.C24H28Cl2N6O2S
Mol. Mass.535.489
SMILESCN1CCN(CCCN=C(N)c2c(Nc3ccc(Oc4cc(Cl)ccc4Cl)cc3)s[nH]c2=O)CC1