Reaction Details
TargetMitogen-activated protein kinase 14
LigandBDBM14949
Substrate/Competitorn/a
Meas. Tech.ChEMBL_396625 (CHEMBL853498)
IC50 6±n/a nM
Citation DiMauro, EFNewcomb, JNunes, JJBemis, JEBoucher, CBuchanan, JLBuckner, WHCee, VJChai, LDeak, HLEpstein, LFFaust, TGallant, PGeuns-Meyer, SDGore, AGu, YHenkle, BHodous, BLHsieh, FHuang, XKim, JLLee, JHMartin, MWMasse, CEMcGowan, DCMetz, DMohn, DMorgenstern, KAOliveira-dos-Santos, APatel, VFPowers, DRose, PESchneider, STomlinson, SATudor, YYTurci, SMWelcher, AAWhite, RDZhao, HZhu, LZhu, X Discovery of aminoquinazolines as potent, orally bioavailable inhibitors of Lck: synthesis, SAR, and in vivo anti-inflammatory activity. J Med Chem49:5671-86 (2006) 
 
Mitogen-activated protein kinase 14
Name:Mitogen-activated protein kinase 14
Type:Serine/threonine-protein kinase
Mol. Mass.:41286.76
Organism:Homo sapiens (Human)
Description:Q16539
Residue:360
BDBM14949
NameBDBM14949
Synonyms:2-aminoquinazoline 5 CHEMBL385937 | JMC511681 Compound 34
TypeSmall organic molecule
Emp. Form.C23H17F3N4O
Mol. Mass.422.4025
SMILESCc1ccc(cc1-c1ccc2nc(N)ncc2c1)C(=O)Nc1cccc(c1)C(F)(F)F