Reaction Details
TargetTyrosine-protein kinase Lck
LigandBDBM50194684
Substrate/Competitorn/a
Meas. Tech.ChEMBL_396621 (CHEMBL913225)
IC50 0.010000±n/a nM
Citation DiMauro, EFNewcomb, JNunes, JJBemis, JEBoucher, CBuchanan, JLBuckner, WHCee, VJChai, LDeak, HLEpstein, LFFaust, TGallant, PGeuns-Meyer, SDGore, AGu, YHenkle, BHodous, BLHsieh, FHuang, XKim, JLLee, JHMartin, MWMasse, CEMcGowan, DCMetz, DMohn, DMorgenstern, KAOliveira-dos-Santos, APatel, VFPowers, DRose, PESchneider, STomlinson, SATudor, YYTurci, SMWelcher, AAWhite, RDZhao, HZhu, LZhu, X Discovery of aminoquinazolines as potent, orally bioavailable inhibitors of Lck: synthesis, SAR, and in vivo anti-inflammatory activity. J Med Chem49:5671-86 (2006) 
 
Tyrosine-protein kinase Lck
Name:Tyrosine-protein kinase Lck
Type:n/a
Mol. Mass.:57987.83
Organism:Homo sapiens (Human)
Description:P06239
Residue:509
BDBM50194684
NameBDBM50194684
Synonyms:4-methyl-N-(2-methyl-3-4-methyl-N-(2-methyl-3-(2-(methylamino)quinazolin-6-yl)benzamide | CHEMBL215969
TypeSmall organic molecule
Emp. Form.C25H21F3N4O
Mol. Mass.450.4556
SMILESCNc1ncc2cc(ccc2n1)-c1cc(ccc1C)C(=O)Nc1cccc(c1C)C(F)(F)F