Reaction Details
TargetTyrosine-protein kinase JAK3
LigandBDBM50194675
Substrate/Competitorn/a
Meas. Tech.ChEMBL_396626 (CHEMBL853499)
IC50>8333±n/a nM
Citation DiMauro, EFNewcomb, JNunes, JJBemis, JEBoucher, CBuchanan, JLBuckner, WHCee, VJChai, LDeak, HLEpstein, LFFaust, TGallant, PGeuns-Meyer, SDGore, AGu, YHenkle, BHodous, BLHsieh, FHuang, XKim, JLLee, JHMartin, MWMasse, CEMcGowan, DCMetz, DMohn, DMorgenstern, KAOliveira-dos-Santos, APatel, VFPowers, DRose, PESchneider, STomlinson, SATudor, YYTurci, SMWelcher, AAWhite, RDZhao, HZhu, LZhu, X Discovery of aminoquinazolines as potent, orally bioavailable inhibitors of Lck: synthesis, SAR, and in vivo anti-inflammatory activity. J Med Chem49:5671-86 (2006) 
 
Tyrosine-protein kinase JAK3
Name:Tyrosine-protein kinase JAK3
Type:Protein
Mol. Mass.:125111.08
Organism:Homo sapiens (Human)
Description:P52333
Residue:1124
BDBM50194675
NameBDBM50194675
Synonyms:4-methyl-N-(2-methyl-3-(trifluoromethyl)phenyl)-3-(2-(1-methylpiperidin-4-ylamino)quinazolin-6-yl)benzamide | CHEMBL215691
TypeSmall organic molecule
Emp. Form.C30H30F3N5O
Mol. Mass.533.5873
SMILESCN1CCC(CC1)Nc1ncc2cc(ccc2n1)-c1cc(ccc1C)C(=O)Nc1cccc(c1C)C(F)(F)F