Reaction Details
TargetTyrosine-protein kinase Lck
LigandBDBM50194674
Substrate/Competitorn/a
Meas. Tech.ChEMBL_396621 (CHEMBL913225)
IC50 1±n/a nM
Citation DiMauro, EFNewcomb, JNunes, JJBemis, JEBoucher, CBuchanan, JLBuckner, WHCee, VJChai, LDeak, HLEpstein, LFFaust, TGallant, PGeuns-Meyer, SDGore, AGu, YHenkle, BHodous, BLHsieh, FHuang, XKim, JLLee, JHMartin, MWMasse, CEMcGowan, DCMetz, DMohn, DMorgenstern, KAOliveira-dos-Santos, APatel, VFPowers, DRose, PESchneider, STomlinson, SATudor, YYTurci, SMWelcher, AAWhite, RDZhao, HZhu, LZhu, X Discovery of aminoquinazolines as potent, orally bioavailable inhibitors of Lck: synthesis, SAR, and in vivo anti-inflammatory activity. J Med Chem49:5671-86 (2006) 
 
Tyrosine-protein kinase Lck
Name:Tyrosine-protein kinase Lck
Type:n/a
Mol. Mass.:57987.83
Organism:Homo sapiens (Human)
Description:P06239
Residue:509
BDBM50194674
NameBDBM50194674
Synonyms:4-methyl-3-(2-(methylamino)quinazolin-6-yl)-N-(4-(1-methylpiperidin-4-yloxy)phenyl)benzamide | CHEMBL427226
TypeSmall organic molecule
Emp. Form.C29H31N5O2
Mol. Mass.481.5887
SMILESCNc1ncc2cc(ccc2n1)-c1cc(ccc1C)C(=O)Nc1ccc(OC2CCN(C)CC2)cc1