Reaction Details
TargetTyrosine-protein kinase ZAP-70
LigandBDBM50194671
Substrate/Competitorn/a
Meas. Tech.ChEMBL_396658 (CHEMBL871551)
IC50>25000±n/a nM
Citation DiMauro, EFNewcomb, JNunes, JJBemis, JEBoucher, CBuchanan, JLBuckner, WHCee, VJChai, LDeak, HLEpstein, LFFaust, TGallant, PGeuns-Meyer, SDGore, AGu, YHenkle, BHodous, BLHsieh, FHuang, XKim, JLLee, JHMartin, MWMasse, CEMcGowan, DCMetz, DMohn, DMorgenstern, KAOliveira-dos-Santos, APatel, VFPowers, DRose, PESchneider, STomlinson, SATudor, YYTurci, SMWelcher, AAWhite, RDZhao, HZhu, LZhu, X Discovery of aminoquinazolines as potent, orally bioavailable inhibitors of Lck: synthesis, SAR, and in vivo anti-inflammatory activity. J Med Chem49:5671-86 (2006) 
 
Tyrosine-protein kinase ZAP-70
Name:Tyrosine-protein kinase ZAP-70
Type:Enzyme
Mol. Mass.:69881.61
Organism:Homo sapiens (Human)
Description:ZAP-70 SH2 domain was expressed and purified from E. coli using O-phospho-L-tyrosine-agarose column.
Residue:619
BDBM50194671
NameBDBM50194671
Synonyms:4-methyl-3-(2-(methylamino)quinazolin-6-yl)-N-(2-(1-methylpiperidin-4-yloxy)-5-(trifluoromethyl)phenyl)benzamide | CHEMBL386661
TypeSmall organic molecule
Emp. Form.C30H30F3N5O2
Mol. Mass.549.5867
SMILESCNc1ncc2cc(ccc2n1)-c1cc(ccc1C)C(=O)Nc1cc(ccc1OC1CCN(C)CC1)C(F)(F)F