Reaction Details
TargetTyrosine-protein kinase Lck
LigandBDBM50194682
Substrate/Competitorn/a
Meas. Tech.ChEMBL_396621 (CHEMBL913225)
IC50 297±n/a nM
Citation DiMauro, EFNewcomb, JNunes, JJBemis, JEBoucher, CBuchanan, JLBuckner, WHCee, VJChai, LDeak, HLEpstein, LFFaust, TGallant, PGeuns-Meyer, SDGore, AGu, YHenkle, BHodous, BLHsieh, FHuang, XKim, JLLee, JHMartin, MWMasse, CEMcGowan, DCMetz, DMohn, DMorgenstern, KAOliveira-dos-Santos, APatel, VFPowers, DRose, PESchneider, STomlinson, SATudor, YYTurci, SMWelcher, AAWhite, RDZhao, HZhu, LZhu, X Discovery of aminoquinazolines as potent, orally bioavailable inhibitors of Lck: synthesis, SAR, and in vivo anti-inflammatory activity. J Med Chem49:5671-86 (2006) 
 
Tyrosine-protein kinase Lck
Name:Tyrosine-protein kinase Lck
Type:n/a
Mol. Mass.:57987.83
Organism:Homo sapiens (Human)
Description:P06239
Residue:509
BDBM50194682
NameBDBM50194682
Synonyms:CHEMBL213478 | N-methyl-6-(2-methyl-5-(5-(trifluoromethyl)-1Hbenzo[d]imidazol-2-ylamino)phenyl)quinazolin-2-amine
TypeSmall organic molecule
Emp. Form.C24H19F3N6
Mol. Mass.448.4431
SMILESCNc1ncc2cc(ccc2n1)-c1cc(Nc2nc3ccc(cc3[nH]2)C(F)(F)F)ccc1C