Reaction Details
TargetVascular endothelial growth factor receptor 2
LigandBDBM50194695
Substrate/Competitorn/a
Meas. Tech.ChEMBL_396624 (CHEMBL853495)
IC50 15±n/a nM
Citation DiMauro, EFNewcomb, JNunes, JJBemis, JEBoucher, CBuchanan, JLBuckner, WHCee, VJChai, LDeak, HLEpstein, LFFaust, TGallant, PGeuns-Meyer, SDGore, AGu, YHenkle, BHodous, BLHsieh, FHuang, XKim, JLLee, JHMartin, MWMasse, CEMcGowan, DCMetz, DMohn, DMorgenstern, KAOliveira-dos-Santos, APatel, VFPowers, DRose, PESchneider, STomlinson, SATudor, YYTurci, SMWelcher, AAWhite, RDZhao, HZhu, LZhu, X Discovery of aminoquinazolines as potent, orally bioavailable inhibitors of Lck: synthesis, SAR, and in vivo anti-inflammatory activity. J Med Chem49:5671-86 (2006) 
 
Vascular endothelial growth factor receptor 2
Name:Vascular endothelial growth factor receptor 2
Type:Receptor Tyrosine Kinase
Mol. Mass.:151510.97
Organism:Homo sapiens (Human)
Description:P35968
Residue:1356
BDBM50194695
NameBDBM50194695
Synonyms:4-methyl-N-(2-methyl-3-(trifluoromethyl)phenyl)-3-(2-(2-morpholinoethylamino)quinazolin-6-yl)benzamide | CHEMBL213290
TypeSmall organic molecule
Emp. Form.C30H30F3N5O2
Mol. Mass.549.5867
SMILESCc1ccc(cc1-c1ccc2nc(NCCN3CCOCC3)ncc2c1)C(=O)Nc1cccc(c1C)C(F)(F)F