Reaction Details
TargetCannabinoid receptor 1
LigandBDBM50195532
Substrate/Competitorn/a
Meas. Tech.ChEMBL_415682 (CHEMBL853846)
Ki 17±n/a nM
Citation Hurst, DUmejiego, ULynch, DSeltzman, HHyatt, SRoche, MMcAllister, SFleischer, DKapur, AAbood, MShi, SJones, JLewis, DReggio, P Biarylpyrazole inverse agonists at the cannabinoid CB1 receptor: importance of the C-3 carboxamide oxygen/lysine3.28(192) interaction. J Med Chem49:5969-87 (2006) 
 
Cannabinoid receptor 1
Name:Cannabinoid receptor 1
Type:G Protein-Coupled Receptor (GPCR)
Mol. Mass.:52868.96
Organism:Homo sapiens (Human)
Description:P21554
Residue:472
BDBM50195532
NameBDBM50195532
Synonyms:5-(4-chlorophenyl)-1-(2,4-dichlorophenyl)-4-methyl-3-[(E)-piperidinoiminomethyl]-1H-pyrazole | CHEMBL385768
TypeSmall organic molecule
Emp. Form.C22H21Cl3N4
Mol. Mass.447.788
SMILESCc1c(\C=N\N2CCCCC2)nn(c1-c1ccc(Cl)cc1)-c1ccc(Cl)cc1Cl