Reaction Details
TargetProtein kinase C theta type
LigandBDBM50196972
Substrate/Competitorn/a
Meas. Tech.ChEMBL_453152 (CHEMBL902302)
IC50 18±n/a nM
Citation Cywin, CLDahmann, GProkopowicz, ASYoung, ERMagolda, RLCardozo, MGCogan, DADisalvo, DGinn, JDKashem, MAWolak, JPHomon, CAFarrell, TMGrbic, HHu, HKaplita, PVLiu, LHSpero, DMJeanfavre, DDO'Shea, KMWhite, DMWoska, JRBrown, ML Discovery of potent and selective PKC-theta inhibitors. Bioorg Med Chem Lett17:225-30 (2006) 
 
Protein kinase C theta type
Name:Protein kinase C theta type
Type:Serine/threonine-protein kinase
Mol. Mass.:81878.04
Organism:Homo sapiens (Human)
Description:Full-length human PKC theta (Panvera Catalog No. P2996).
Residue:706
BDBM50196972
NameBDBM50196972
Synonyms:CHEMBL248183 | N2-(2-(trifluoromethoxy)benzyl)-N4-((4-(aminomethyl)cyclohexyl)methyl)-5-nitropyrimidine-2,4-diamine
TypeSmall organic molecule
Emp. Form.C20H25F3N6O3
Mol. Mass.454.4461
SMILESNCC1CCC(CNc2nc(NCc3ccccc3OC(F)(F)F)ncc2[N+]([O-])=O)CC1