Reaction Details
TargetMelanin-concentrating hormone receptor 1
LigandBDBM50185042
Substrate/Competitorn/a
Meas. Tech.ChEMBL_408728 (CHEMBL908288)
IC50 11±n/a nM
Citation Lynch, JKFreeman, JCJudd, ASIyengar, RMulhern, MZhao, GNapier, JJWodka, DBrodjian, SDayton, BDFalls, DOgiela, CReilly, RMCampbell, TJPolakowski, JSHernandez, LMarsh, KCShapiro, RKnourek-Segel, VDroz, BBush, EBrune, MPreusser, LCFryer, RMReinhart, GAHouseman, KDiaz, GMikhail, ALimberis, JTSham, HLCollins, CAKym, PR Optimization of chromone-2-carboxamide melanin concentrating hormone receptor 1 antagonists: assessment of potency, efficacy, and cardiovascular safety. J Med Chem49:6569-84 (2006) 
 
Melanin-concentrating hormone receptor 1
Name:Melanin-concentrating hormone receptor 1
Type:G Protein-Coupled Receptor (GPCR)
Mol. Mass.:45976.27
Organism:Homo sapiens (Human)
Description:Membranes from CHO-K1 cells stably expressing human MCH1R were used in assays.
Residue:422
BDBM50185042
NameBDBM50185042
Synonyms:CHEMBL206081 | N-[1-(1,3-benzodioxol-5-ylmethyl)piperidin-4-yl]-7-methoxy-4-oxo-4H-chromene-2-carboxamide
TypeSmall organic molecule
Emp. Form.C24H24N2O6
Mol. Mass.436.4572
SMILESCOc1ccc2c(c1)oc(cc2=O)C(=O)NC1CCN(Cc2ccc3OCOc3c2)CC1