Reaction Details
TargetPotassium voltage-gated channel subfamily H member 2
LigandBDBM50197111
Substrate/Competitorn/a
Meas. Tech.ChEMBL_408752 (CHEMBL909940)
IC50 3.6±n/a nM
Citation Lynch, JKFreeman, JCJudd, ASIyengar, RMulhern, MZhao, GNapier, JJWodka, DBrodjian, SDayton, BDFalls, DOgiela, CReilly, RMCampbell, TJPolakowski, JSHernandez, LMarsh, KCShapiro, RKnourek-Segel, VDroz, BBush, EBrune, MPreusser, LCFryer, RMReinhart, GAHouseman, KDiaz, GMikhail, ALimberis, JTSham, HLCollins, CAKym, PR Optimization of chromone-2-carboxamide melanin concentrating hormone receptor 1 antagonists: assessment of potency, efficacy, and cardiovascular safety. J Med Chem49:6569-84 (2006) 
 
Potassium voltage-gated channel subfamily H member 2
Name:Potassium voltage-gated channel subfamily H member 2
Type:Multi-pass membrane protein
Mol. Mass.:126672.65
Organism:Homo sapiens (Human)
Description:Q12809
Residue:1159
BDBM50197111
NameBDBM50197111
Synonyms:CHEMBL213715 | N-[1-(1,3-benzodioxol-5-ylmethyl)piperidin-4-yl]-7-(difluoromethoxy)-4-oxo-4H-chromene-2-carboxamide
TypeSmall organic molecule
Emp. Form.C24H22F2N2O6
Mol. Mass.472.4381
SMILESFC(F)Oc1ccc2c(c1)oc(cc2=O)C(=O)NC1CCN(Cc2ccc3OCOc3c2)CC1